first_name,last_name,city,name,ovr,ovr_raw,chemistry,position,depth_chart_rank,age,consistency,culture,salary,salary_years,strength,speed,agility,jumping,mental,stamina,catching,break_tackles,carrying,run_defense,pass_rushing,pass_coverage,run_blocking,pass_blocking,throwing_power,throwing_accuracy,kicking_power,kicking_accuracy,id
Billy,Williams,,,95,95,0,WR,,27,-5,Strategic,9.4,,12,97,102,94,94,100,98,96,59,47,45,42,99,46,55,50,55,46,"=HYPERLINK(""https://progressionfootball.com/players?league=4146&player=22763240"")"
Josh,Alonso,,,93,93,0,WR,,29,-3,Energetic,8.7,,12,97,93,97,95,93,95,95,35,42,41,41,92,47,43,56,55,58,"=HYPERLINK(""https://progressionfootball.com/players?league=4146&player=22763222"")"
Brannon,Hegmann,,,92,92,0,WR,,28,-5,Strategic,6.5,,12,90,90,91,91,97,96,96,51,41,43,40,95,58,52,54,43,58,"=HYPERLINK(""https://progressionfootball.com/players?league=4146&player=22763213"")"
Gabe,Williams,,,92,92,0,WR,,24,-7,Strategic,4.2,,12,91,92,92,97,93,95,94,57,50,56,43,88,57,50,52,57,41,"=HYPERLINK(""https://progressionfootball.com/players?league=4146&player=22763228"")"
Jeremiah,Long,,,92,92,0,WR,,23,-6,Energetic,4.2,,12,93,98,92,96,89,95,95,46,42,52,42,91,40,57,53,56,49,"=HYPERLINK(""https://progressionfootball.com/players?league=4146&player=22763238"")"
Robbie,Schaub,,,91,91,0,WR,,29,-2,Strategic,6.2,,12,86,93,88,87,87,95,96,39,44,58,52,84,45,45,59,42,48,"=HYPERLINK(""https://progressionfootball.com/players?league=4146&player=22763239"")"
Jonathan,Cox,,,91,91,0,WR,,23,-5,Strategic,6.7,,12,95,90,91,89,98,92,96,46,56,54,60,93,51,46,51,43,47,"=HYPERLINK(""https://progressionfootball.com/players?league=4146&player=22763246"")"
Keshaun,Solis,,,91,91,0,WR,,35,-2,Aggressive,7.5,,12,91,96,91,88,93,95,91,50,45,51,50,91,45,51,55,56,54,"=HYPERLINK(""https://progressionfootball.com/players?league=4146&player=22763251"")"
Joshua,Wood,,,90,90,0,WR,,25,-4,Aggressive,5.8,,12,87,87,86,92,93,95,94,60,41,51,58,90,52,48,50,47,49,"=HYPERLINK(""https://progressionfootball.com/players?league=4146&player=22763217"")"
Chris,West,,,90,90,0,WR,,25,-7,Strategic,3.4,,12,88,95,94,95,86,93,91,45,44,41,58,99,56,55,52,58,56,"=HYPERLINK(""https://progressionfootball.com/players?league=4146&player=22763218"")"
Stephen,Cooper,,,90,90,0,WR,,24,-5,Aggressive,6,,12,90,91,89,92,90,93,93,41,58,41,48,99,59,48,47,50,40,"=HYPERLINK(""https://progressionfootball.com/players?league=4146&player=22763231"")"
Michael,Hebert,,,89,89,0,WR,,25,-8,Professional,3.6,,12,93,89,92,92,88,91,94,46,42,51,43,89,40,46,54,47,47,"=HYPERLINK(""https://progressionfootball.com/players?league=4146&player=22763212"")"
Trent,Jackson,,,89,89,0,WR,,28,-2,Strategic,4.5,,12,77,84,89,90,88,94,98,58,58,54,48,81,55,44,53,44,59,"=HYPERLINK(""https://progressionfootball.com/players?league=4146&player=22763227"")"
Mark,Allen,,,89,89,0,WR,,36,-2,Aggressive,7,,12,93,93,92,94,95,90,90,53,40,48,44,92,53,53,53,52,56,"=HYPERLINK(""https://progressionfootball.com/players?league=4146&player=22763234"")"
Deon,Smelter,,,87,87,0,WR,,23,-5,Professional,4,,12,87,91,91,89,91,87,91,49,44,45,40,94,56,55,53,56,41,"=HYPERLINK(""https://progressionfootball.com/players?league=4146&player=22763233"")"
Austin,Jones,,,87,87,0,WR,,26,-6,Aggressive,3.9,,12,82,82,85,85,89,91,95,59,46,59,55,78,59,41,47,43,56,"=HYPERLINK(""https://progressionfootball.com/players?league=4146&player=22763241"")"
L.P.,Bryant,,,87,87,0,WR,,34,-1,Aggressive,7.2,,12,99,92,92,94,91,85,89,54,46,57,46,86,40,58,44,44,51,"=HYPERLINK(""https://progressionfootball.com/players?league=4146&player=22763247"")"
Garrison,Conley,,,86,86,0,WR,,21,-5,Energetic,2.4,,12,83,87,87,85,82,89,93,59,46,40,47,86,55,54,45,40,54,"=HYPERLINK(""https://progressionfootball.com/players?league=4146&player=22763221"")"
David,Scarlett,,,84,84,0,WR,,26,-7,Professional,3.4,,12,90,89,89,87,85,84,88,46,41,53,50,97,60,53,47,43,47,"=HYPERLINK(""https://progressionfootball.com/players?league=4146&player=22763236"")"
Heber,Marquez,,,84,84,0,WR,,23,-5,Aggressive,2.7,,12,81,82,89,82,85,88,85,64,40,48,55,83,42,48,53,45,45,"=HYPERLINK(""https://progressionfootball.com/players?league=4146&player=22763250"")"
Reuben,Blackson,,,83,83,0,WR,,23,-5,Energetic,1.9,,12,79,80,80,82,84,87,91,38,49,56,49,81,57,54,50,46,52,"=HYPERLINK(""https://progressionfootball.com/players?league=4146&player=22763216"")"
Victor,Marquardt,,,83,83,0,WR,,26,-7,Energetic,3.1,,12,92,89,87,91,86,83,82,44,55,56,60,84,44,41,43,51,42,"=HYPERLINK(""https://progressionfootball.com/players?league=4146&player=22763229"")"
Joseph,Qvale,,,83,83,0,WR,,26,-6,Energetic,3.4,,12,89,82,85,85,88,85,86,47,55,60,52,99,51,47,59,56,51,"=HYPERLINK(""https://progressionfootball.com/players?league=4146&player=22763242"")"
Stephen,Cooper,CPU,"Draft Challenge 1",83,90,-7,WR,1,24,-5,Aggressive,6,,12,90,91,89,91,87,93,93,40,58,41,48,99,59,48,47,50,40,"=HYPERLINK(""https://progressionfootball.com/players?league=4146&player=22763617"")"
Stephen,Cooper,Cocopunch88,Sheriffs,83,90,-7,WR,2,24,-5,Aggressive,6,,12,90,95,88,87,90,93,96,46,58,41,48,99,59,48,47,50,40,"=HYPERLINK(""https://progressionfootball.com/players?league=4146&player=22773118"")"
Joshua,Wood,Cocopunch88,Sheriffs,83,90,-7,WR,1,25,-4,Aggressive,5.8,,12,87,91,89,94,90,95,93,61,41,51,58,90,52,48,50,47,49,"=HYPERLINK(""https://progressionfootball.com/players?league=4146&player=22773120"")"
Julie'n,Lane,,,82,82,0,WR,,28,-6,Aggressive,4.2,,12,94,89,88,91,85,81,77,61,60,56,58,79,46,41,50,50,52,"=HYPERLINK(""https://progressionfootball.com/players?league=4146&player=22763219"")"
Shawn,Hoeger,,,82,82,0,WR,,28,-5,Professional,3.9,,12,87,82,81,88,84,84,87,58,42,59,42,82,52,47,58,58,40,"=HYPERLINK(""https://progressionfootball.com/players?league=4146&player=22763225"")"
Ryan,Alonso,,,82,82,0,WR,,24,-7,Strategic,1.9,,12,78,82,81,80,79,85,87,39,45,60,51,82,56,44,54,56,55,"=HYPERLINK(""https://progressionfootball.com/players?league=4146&player=22763226"")"
Jean,Bowers,,,82,82,0,WR,,25,-8,Energetic,3.6,,12,91,82,84,89,84,83,83,56,56,42,40,82,50,60,49,59,55,"=HYPERLINK(""https://progressionfootball.com/players?league=4146&player=22763230"")"
Chris,West,CPU,"Draft Challenge 1",82,90,-7,WR,3,25,-7,Strategic,3.4,,12,88,94,94,90,95,93,93,45,44,41,58,99,56,55,52,58,56,"=HYPERLINK(""https://progressionfootball.com/players?league=4146&player=22763624"")"
Stephen,Cooper,CPU,"Draft Challenge 3",82,90,-7,WR,1,24,-5,Aggressive,6,,12,90,95,88,96,88,93,89,49,58,41,48,99,59,48,47,50,40,"=HYPERLINK(""https://progressionfootball.com/players?league=4146&player=22763745"")"
Marcus,Woodard,,,81,81,0,WR,,26,-5,Professional,1.8,,12,73,76,79,78,77,87,90,48,46,57,40,71,44,40,40,40,47,"=HYPERLINK(""https://progressionfootball.com/players?league=4146&player=22763223"")"
Rick,Green,,,81,81,0,WR,,27,-7,Strategic,2.5,,12,83,83,81,85,78,82,86,47,43,54,45,80,45,51,48,40,57,"=HYPERLINK(""https://progressionfootball.com/players?league=4146&player=22763243"")"
Garrison,Conley,CPU,"Draft Challenge 1",81,86,-7,WR,2,21,-5,Energetic,2.4,,12,83,87,89,86,82,89,91,62,46,40,47,86,55,54,45,40,54,"=HYPERLINK(""https://progressionfootball.com/players?league=4146&player=22763607"")"
Clay,Palacios,,,80,80,0,WR,,23,-8,Aggressive,2.1,,12,81,82,82,81,81,81,85,56,40,53,43,92,56,55,47,55,41,"=HYPERLINK(""https://progressionfootball.com/players?league=4146&player=22763235"")"
Grover,Clinton-Dix,,,80,80,0,WR,,20,-8,Strategic,3.1,,12,90,82,83,82,84,79,84,54,44,45,42,91,58,55,40,42,41,"=HYPERLINK(""https://progressionfootball.com/players?league=4146&player=22763244"")"
Sylvester,Vanderdoes,,,80,80,0,WR,,29,-3,Energetic,3.6,,12,85,82,82,82,86,82,79,48,45,43,53,75,55,59,48,52,46,"=HYPERLINK(""https://progressionfootball.com/players?league=4146&player=22763245"")"
Kyle,Lowery,,,79,79,0,WR,,20,-5,Strategic,1.8,,12,82,81,78,86,81,81,80,40,47,41,44,84,41,57,58,60,43,"=HYPERLINK(""https://progressionfootball.com/players?league=4146&player=22763215"")"
Rakeem,Dawson,,,79,79,0,WR,,24,-8,Energetic,1.8,,12,86,86,81,82,83,78,82,62,50,44,41,81,50,56,58,59,47,"=HYPERLINK(""https://progressionfootball.com/players?league=4146&player=22763248"")"
L.P.,Bryant,CPU,"Draft Challenge 2",79,86,-7,WR,1,34,-1,Aggressive,7.2,,12,99,91,94,88,88,85,84,53,46,57,46,86,40,58,44,44,51,"=HYPERLINK(""https://progressionfootball.com/players?league=4146&player=22763681"")"
Austin,Jones,CPU,"Draft Challenge 2",79,86,-7,WR,3,26,-6,Aggressive,3.9,,12,82,86,85,91,86,91,88,58,46,59,55,78,59,41,47,43,56,"=HYPERLINK(""https://progressionfootball.com/players?league=4146&player=22763686"")"
Victor,Marquardt,CPU,"Draft Challenge 2",79,84,-7,WR,2,26,-7,Energetic,3.1,,12,92,88,84,85,90,83,87,52,55,56,60,84,44,41,43,51,42,"=HYPERLINK(""https://progressionfootball.com/players?league=4146&player=22763688"")"
Austin,Jones,CPU,"Draft Challenge 3",78,86,-7,WR,3,26,-6,Aggressive,3.9,,12,82,87,83,87,83,91,89,55,46,59,55,78,59,41,47,43,56,"=HYPERLINK(""https://progressionfootball.com/players?league=4146&player=22763758"")"
Michael,Watson,,,77,77,0,WR,,29,-3,Aggressive,2.4,,12,76,81,75,77,82,80,81,44,45,44,47,73,51,48,56,47,48,"=HYPERLINK(""https://progressionfootball.com/players?league=4146&player=22763024"")"
Nate,Zamora,,,77,77,0,WR,,28,-2,Strategic,2.9,,12,81,80,84,84,76,78,77,51,41,57,60,80,57,48,57,49,41,"=HYPERLINK(""https://progressionfootball.com/players?league=4146&player=22763211"")"
Alex,Jones,,,77,77,0,WR,,26,-12,Strategic,1.6,,12,75,73,74,79,75,81,86,50,51,54,43,75,59,59,45,54,58,"=HYPERLINK(""https://progressionfootball.com/players?league=4146&player=22763214"")"
Da'Norris,Campbell,,,77,77,0,WR,,21,-7,Energetic,2.3,,12,81,78,80,78,79,78,80,56,58,51,56,87,47,51,59,53,60,"=HYPERLINK(""https://progressionfootball.com/players?league=4146&player=22763232"")"
Brandon,Dahl,,,77,77,0,WR,,25,-4,Energetic,2.6,,12,83,84,84,76,84,76,77,44,50,54,54,83,56,41,40,47,44,"=HYPERLINK(""https://progressionfootball.com/players?league=4146&player=22763237"")"
Brandon,Gay,,,76,76,0,WR,,26,-9,Strategic,1.9,,12,80,74,80,76,76,77,77,46,50,54,44,81,56,50,47,50,41,"=HYPERLINK(""https://progressionfootball.com/players?league=4146&player=22763224"")"
Steven,Kindred,,,75,75,0,WR,,28,-5,Aggressive,2.5,,12,85,81,77,77,78,74,76,38,45,44,58,73,53,58,51,47,41,"=HYPERLINK(""https://progressionfootball.com/players?league=4146&player=22763220"")"
Julie'n,Lane,CPU,"Draft Challenge 3",74,82,-7,WR,2,28,-6,Aggressive,4.2,,12,94,91,83,92,83,81,79,61,60,56,58,79,46,41,50,50,52,"=HYPERLINK(""https://progressionfootball.com/players?league=4146&player=22763751"")"
Kevin,Collier,,,72,72,0,WR,,27,-2,Strategic,1.4,,12,63,70,66,66,67,77,79,51,44,46,41,61,60,55,52,42,60,"=HYPERLINK(""https://progressionfootball.com/players?league=4146&player=22763029"")"
Lee,Baker,,,72,72,0,WR,,31,-1,Strategic,2.6,,12,85,73,76,76,78,71,72,43,41,44,41,75,57,50,50,59,43,"=HYPERLINK(""https://progressionfootball.com/players?league=4146&player=22763249"")"
Alex,Jones,Cocopunch88,Sheriffs,72,77,-7,WR,4,26,-12,Strategic,1.6,,12,75,80,75,80,77,81,79,50,51,54,43,75,59,59,45,54,58,"=HYPERLINK(""https://progressionfootball.com/players?league=4146&player=22773099"")"
Sheldon,Baker,,,71,71,0,WR,,30,-2,Aggressive,1.8,,12,74,75,72,72,69,71,73,55,52,51,60,71,44,42,40,43,54,"=HYPERLINK(""https://progressionfootball.com/players?league=4146&player=22763033"")"
Alex,Jones,CPU,"Draft Challenge 1",70,78,-7,WR,5,26,-12,Strategic,1.6,,12,75,76,77,76,77,81,86,51,51,54,43,75,59,59,45,54,58,"=HYPERLINK(""https://progressionfootball.com/players?league=4146&player=22763577"")"
Michael,Watson,CPU,"Draft Challenge 1",70,77,-7,WR,4,29,-3,Aggressive,2.4,,12,76,73,79,74,78,80,81,49,45,44,47,73,51,48,56,47,48,"=HYPERLINK(""https://progressionfootball.com/players?league=4146&player=22763579"")"
Brandon,Gay,CPU,"Draft Challenge 3",70,77,-7,WR,4,26,-9,Strategic,1.9,,12,80,80,81,82,79,77,81,44,50,54,44,81,56,50,47,50,41,"=HYPERLINK(""https://progressionfootball.com/players?league=4146&player=22763716"")"
Michael,Watson,Cocopunch88,Sheriffs,70,77,-7,WR,3,29,-3,Aggressive,2.4,,12,76,80,74,75,73,80,82,50,45,44,47,73,51,48,56,47,48,"=HYPERLINK(""https://progressionfootball.com/players?league=4146&player=22773100"")"
Michael,Watson,CPU,"Draft Challenge 3",69,77,-7,WR,5,29,-3,Aggressive,2.4,,12,76,79,79,77,73,80,77,44,45,44,47,73,51,48,56,47,48,"=HYPERLINK(""https://progressionfootball.com/players?league=4146&player=22763714"")"
Jack,Looney,,,68,68,0,WR,,25,-11,Energetic,1,,12,68,72,70,65,69,70,68,37,57,58,57,74,42,49,57,56,58,"=HYPERLINK(""https://progressionfootball.com/players?league=4146&player=22763026"")"
Brandon,Gay,CPU,"Draft Challenge 2",68,76,-7,WR,5,26,-9,Strategic,1.9,,12,80,76,77,76,81,77,81,52,50,54,44,81,56,50,47,50,41,"=HYPERLINK(""https://progressionfootball.com/players?league=4146&player=22763654"")"
Kevin,Collier,Cocopunch88,Sheriffs,68,73,-7,WR,5,27,-2,Strategic,1.4,,12,63,74,74,72,66,77,78,47,44,46,41,61,60,55,52,42,60,"=HYPERLINK(""https://progressionfootball.com/players?league=4146&player=22773101"")"
Chris,Wick,,,67,67,0,WR,,25,-4,Aggressive,1.4,,12,76,71,67,67,75,66,67,54,52,51,54,83,43,59,53,41,53,"=HYPERLINK(""https://progressionfootball.com/players?league=4146&player=22763021"")"
John,McIntosh,,,66,66,0,WR,,25,-15,Aggressive,1,,12,65,63,71,69,68,69,65,62,60,50,42,66,49,42,60,42,42,"=HYPERLINK(""https://progressionfootball.com/players?league=4146&player=22763034"")"
Lee,Baker,CPU,"Draft Challenge 2",65,73,-7,WR,4,31,-1,Strategic,2.6,,12,85,79,82,76,82,71,71,43,41,44,41,75,57,50,50,59,43,"=HYPERLINK(""https://progressionfootball.com/players?league=4146&player=22763658"")"
Kevin,Collier,CPU,"Draft Challenge 2",64,72,-7,WR,6,27,-2,Strategic,1.4,,12,63,71,67,68,65,77,81,53,44,46,41,61,60,55,52,42,60,"=HYPERLINK(""https://progressionfootball.com/players?league=4146&player=22763656"")"
Josh,Avila,,,62,62,0,WR,,25,-8,Energetic,1,,12,68,61,64,62,60,62,64,54,48,56,51,58,54,53,55,51,43,"=HYPERLINK(""https://progressionfootball.com/players?league=4146&player=22763020"")"
Garrett,Parker,,,62,62,0,WR,,28,-6,Aggressive,1,,12,58,62,64,61,60,66,63,51,43,51,49,59,46,60,44,45,47,"=HYPERLINK(""https://progressionfootball.com/players?league=4146&player=22763025"")"
George,Schwartz,,,62,62,0,WR,,21,-14,Energetic,1,,12,68,69,68,64,62,62,58,45,54,59,45,57,41,59,47,57,49,"=HYPERLINK(""https://progressionfootball.com/players?league=4146&player=22763031"")"
Doug,Bowman,,,60,60,0,WR,,20,-15,Aggressive,1,,12,57,57,63,63,58,64,61,44,56,46,40,66,50,59,48,40,46,"=HYPERLINK(""https://progressionfootball.com/players?league=4146&player=22763023"")"
Justin,Kilgo,,,57,57,0,WR,,24,-5,Aggressive,1,,12,52,55,59,57,58,59,63,58,45,60,55,62,50,50,58,47,53,"=HYPERLINK(""https://progressionfootball.com/players?league=4146&player=22763019"")"
George,Schwartz,CPU,"Draft Challenge 1",57,62,-7,WR,6,21,-14,Energetic,1,,12,68,62,61,64,65,62,65,47,54,59,45,57,41,59,47,57,49,"=HYPERLINK(""https://progressionfootball.com/players?league=4146&player=22763580"")"
Josh,Avila,CPU,"Draft Challenge 2",56,61,-7,WR,7,25,-8,Energetic,1,,12,68,64,62,66,67,62,59,59,48,56,51,58,54,53,55,51,43,"=HYPERLINK(""https://progressionfootball.com/players?league=4146&player=22763655"")"
Gabriel,Morstead,,,55,55,0,WR,,24,-9,Professional,1,,12,54,52,53,51,57,58,61,53,49,45,48,67,51,48,55,58,58,"=HYPERLINK(""https://progressionfootball.com/players?league=4146&player=22763022"")"
Joe,Spence,,,55,55,0,WR,,21,-15,Professional,1,,12,64,57,57,58,55,54,57,60,55,52,59,67,56,50,46,48,59,"=HYPERLINK(""https://progressionfootball.com/players?league=4146&player=22763027"")"
Josh,Avila,CPU,"Draft Challenge 3",55,62,-7,WR,6,25,-8,Energetic,1,,12,68,69,60,66,65,62,64,56,48,56,51,58,54,53,55,51,43,"=HYPERLINK(""https://progressionfootball.com/players?league=4146&player=22763715"")"
George,Schwartz,CPU,"Draft Challenge 3",55,62,-7,WR,7,21,-14,Energetic,1,,12,68,62,69,66,64,62,61,47,54,59,45,57,41,59,47,57,49,"=HYPERLINK(""https://progressionfootball.com/players?league=4146&player=22763717"")"
Tavon,Watkins,,,54,54,0,WR,,21,-15,Strategic,1,,12,60,52,55,52,55,53,58,58,58,58,57,53,60,56,42,41,53,"=HYPERLINK(""https://progressionfootball.com/players?league=4146&player=22763028"")"
Jordan,Holba,,,54,54,0,WR,,34,-1,Strategic,1,,12,61,55,54,53,57,55,52,40,55,43,55,63,48,58,48,52,56,"=HYPERLINK(""https://progressionfootball.com/players?league=4146&player=22763030"")"
Doug,Bowman,Cocopunch88,Sheriffs,54,61,-7,WR,6,20,-15,Aggressive,1,,12,57,56,58,63,62,64,68,45,56,46,40,66,50,59,48,40,46,"=HYPERLINK(""https://progressionfootball.com/players?league=4146&player=22773102"")"
Marcus,Hall,,,52,52,0,WR,,28,-6,Aggressive,1,,12,56,49,55,52,53,52,55,39,44,56,60,60,40,54,45,42,58,"=HYPERLINK(""https://progressionfootball.com/players?league=4146&player=22763032"")"
Jordan,Holba,CPU,"Draft Challenge 1",48,56,-7,WR,7,34,-1,Strategic,1,,12,61,60,61,54,61,55,58,44,55,43,55,63,48,58,48,52,56,"=HYPERLINK(""https://progressionfootball.com/players?league=4146&player=22763578"")"
Gabriel,Morstead,CPU,"Draft Challenge 2",48,55,-7,WR,,24,-9,Professional,1,,12,54,53,57,55,55,58,54,52,49,45,48,67,51,48,55,58,58,"=HYPERLINK(""https://progressionfootball.com/players?league=4146&player=22763657"")"
Justin,Kilgo,CPU,"Draft Challenge 3",48,56,-7,WR,,24,-5,Aggressive,1,,12,52,51,55,51,51,59,62,52,45,60,55,62,50,50,58,47,53,"=HYPERLINK(""https://progressionfootball.com/players?league=4146&player=22763713"")"
Joe,Spence,Cocopunch88,Sheriffs,48,55,-7,WR,7,21,-15,Professional,1,,12,64,57,55,57,58,54,54,59,55,52,59,67,56,50,46,48,59,"=HYPERLINK(""https://progressionfootball.com/players?league=4146&player=22773103"")"
Tavon,Watkins,CPU,"Draft Challenge 1",44,52,-7,WR,,21,-15,Strategic,1,,12,60,54,52,52,55,53,50,63,58,58,57,53,60,56,42,41,53,"=HYPERLINK(""https://progressionfootball.com/players?league=4146&player=22763581"")"
